{"text_format":"1","workbook":"xlsx","n_sheets":3,"sheets":["požadavky","Dotazník","kolektory"],"not_rendered":{"charts":0,"images":2,"macros":1,"external_links":0,"defined_names":60,"comments":0,"pivot_tables":0},"unopened":[],"bounds":{"document_bytes":16777216,"sheet_cells":100000,"rows_first":2000,"rows_last":500,"rows_between":2000,"halvings":0,"cell_chars":16384,"cell_head_chars":4096},"cells_cut":0,"cells_raw":0,"read":"whole","date_system":"1900"}

{"sheet":"požadavky","index":0,"n_rows":12,"n_cols":2,"rows_kept":12,"cut":false,"hidden":false,"merged":[]}
["1.","Žadatel (FO) je vlastník nemovitosti."]
["2.","Nemovitost byla dokončena před 1.1.2021."]
["3.","Spolu s dalšími členy domácnosti vlastní max. 2 nemovitosti pro bydlení - seznam osob nutno doložit - jména+data narození."]
["4.","Žadatel (nebo rodiče/děti) má v nemovitosti, na kterou žádá trvalý pobyt (nebo bude mít ke dni doložení realizace) a bude mít i dalších 5 let. "]
["5.","Plocha využívaná k ekonomické činnosti, popř. k pronájmu nesmí přesáhnout 20 % celkové plochy podporované nemovitosti."]
["6.","Zatím nemá zrealizováno nebo max před 12 měsíci."]
["7.","Realizaci stihne do 2 let."]
["8.","Na dané opatření od roku 2009 nečerpal žádnou dotaci."]
["9.","SOL - Nežádal v minulosti na tepelné čerpadlo pro vytápění i ohřev nebo fotovoltaický systém."]
[null,"TČ i pro ohřev vody - Nežádal v minulosti na solární termický systém."]
["9.","TČ - Pokud vyměňuje jiný zdroj než elektrokotel a nemovitost byla dokončena před 1.1.2009 musí být výpočtem prokázána vhodnost tepelného čerpadla pro danou nemovitost."]
["10.","TČ - Starý zdroj zlikviduje (kromě elektrokotle a plynového kotle)."]

{"sheet":"Dotazník","index":1,"n_rows":80,"n_cols":6,"rows_kept":80,"cut":false,"hidden":false,"merged":[[0,1,0,3],[6,5,6,8],[35,1,35,2],[14,1,14,2],[29,1,29,2],[17,5,28,8],[11,5,11,8],[11,1,11,2],[34,1,34,2],[31,1,31,2],[18,1,20,1],[21,1,24,1],[35,5,35,8],[4,1,7,1],[8,1,9,1],[25,1,28,1],[2,1,2,3],[33,1,33,3],[40,1,40,3],[38,5,38,8],[36,5,37,8],[38,1,38,2],[30,1,30,2],[3,1,3,2],[36,1,37,1],[17,1,17,2],[16,1,16,3],[12,1,12,2],[10,1,10,2],[3,5,5,8],[14,5,14,8],[41,5,41,8],[64,5,65,8],[56,5,56,8],[61,5,61,8],[64,1,65,1],[41,1,41,2],[44,1,44,2],[57,1,59,1],[43,1,43,2],[42,1,42,2],[53,1,54,1],[59,5,59,8],[45,5,45,8],[49,5,49,8],[62,1,63,1],[56,1,56,3],[45,1,48,1],[49,1,52,1],[60,1,61,1],[76,1,76,3],[77,1,77,3],[78,1,78,3],[79,1,79,3],[66,1,68,1],[74,1,74,3],[71,1,71,2],[70,1,70,3]]}
[null,"DOTAZNÍK NZÚ\n- SOLÁRNÍ SYSTÉMY  / TEPELNÁ ČERPADLA"]
[]
["A","IDENTIFIKACE NEMOVITOSTI ",null,null,null,"Takto obarvená pole jsou povinná, kde je Vyberte použijte šipku napravo vedle buňky."]
[null,"typ budovy",null,"Vyberte",null,"V katastru nemovitostí musí být jako způsob využití uveden rodinný dům, objekt k bydlení nebo stavba pro rodinnou rekceaci. Žadatel musí být vlastník, trvalé bydliště musí doložit pouze u rekrečních objektů (nejméně 2 roky před podáním žádosti)."]
[null,"adresa realizace","ulice",""]
[null,null,"č.p.",""]
[null,null,"město","",null,"Klik pro nahlížení do katastru"]
[null,null,"PSČ",""]
[null,"katastrální území","název",""]
[null,null,"číslo",""]
[null,"číslo parcely domu",null,""]
[null,"dokončení nemovitosti",null,"Vyberte",null,"Žádat lze pouze na objekty dokončené před 1.1.2021. U objektů kolaudovaných před 1.1.2009 vytápěných jinak než elektrickým vytápěním je povinnou přílohou posouzení vhodnosti instalace tepelného čerpadla."]
[null,"počet bytových jednotek",null,"Vyberte"]
[null,null,"Je nemovitost využívána k ekonomické činnosti?"]
[null,"počet osob obývajících trvale dům",null,"",null,"Nutno dodat seznam všech členů domácnosti (i nezletilé děti) včetně dat narození."]
[]
["B","IDENTIFIKAČNÍ ÚDAJE ŽADATELE (musí být vlastníkem domu)"]
[null,"Typ žadatele",null,"Fyzická osoba",null,"\nPokud se jedná o fyzickou osobu, pak nevyplňujte pole s červeným textem.\n\nPokud se jedná o firmu nebo podnikající fyzickou osobu, pak nevyplňujte pole s modrým textem.\n\nŽadatel čestně prohlašuje, že má zajištěn souhlas spoluvlastníků nemovitosti s provedením opatření.\n"]
[null,"fyzická osoba (FO)","jméno",""]
[null,null,"příjmení",""]
[null,null,"datum narození",""]
[null,"firma (FI)","fima",""," "]
[null,null,"IČO",""]
[null,null,"jméno zodp. osoby",""]
[null,null,"příjmení zodp. osoby",""]
[null,"adresa trvalého \nbydliště FO \nnebo sídlo FI","ulice",""]
[null,null,"č.p.",""]
[null,null,"město",""]
[null,null,"PSČ",""]
[null,"telefon",null,""]
[null,"e-mail",null,""]
[null,"číslo bank. účtu (vlastníkem musí být žadatel)",null,"",null,"Dokument prokazující vlastnictví bankovního účtu žadatele je povinnou přílohou žádosti."]
[]
["C","ŽÁDOST O PODPORU "]
[null,"typ opatření",null,"Vyberte"]
[null,"kombinace více opatření",null,"Vyberte",null,"Další opatření uveďte do poznámky."]
[null,"odborný dodavatel","název","",null,"Montážník musí mít osvědčení o získané profesní kvalifikaci. Seznam osob, které mají toto osvědčení je na stránkách MPO."]
[null,null,"IČO",""]
[null,"termín realizace",null,"",null,"Klik po zobrazení stránky MPO - seznam je dole v přílohách"]
[]
["D","PARAMETRY BUDOVY (před započetím opatření)",null,null,null,"Žlutá pole jsou povinná pouze pro některá opatřená."]
[null,{"$f":"IF($D$35=\"ohřev teplé vody\",\"\",\"energetická náročnost budovy\")","v":"energetická náročnost budovy"},null,"Vyberte",null,"U novostaveb žadatel doloží PENB."]
[null,{"$f":"IF($D$35=\"ohřev teplé vody\",\"\",\"tepelná ztráta budovy\")","v":"tepelná ztráta budovy"},null,""]
[null,{"$f":"IF($D$35=\"ohřev teplé vody\",\"\",\"otopná soustava\")","v":"otopná soustava"},null,"Vyberte"]
[null,"napojení na centrální zásobování teplem",null,"Vyberte"]
[null,"stávající zásobník teplé vody","typ","",null,"Opište údaje ze štítku např. zásobník o objemu 55l v kotli Them 17 KDZ 5"]
[null,null,"zdroj energie",""]
[null,null,"objem [l]",""]
[null,null,"zůstane zachován","Vyberte"]
[null,"stávající zdroj vytápění","typ","",null,"Opište údaje ze štítku např. Thermona 17 KDZ"]
[null,null,"zdroj energie",""]
[null,null,"výkon [kW]",""]
[null,null,"zůstane zachován","Vyberte"]
[null,"střecha","typ","Vyberte"]
[null,null,"sklon",""]
[]
["E","Instalovaný nový zdroj a parametry systému",null,null,null,"Žadatel doloží fotky instalovaného nového zdroje."]
[null,"kolektory Regulus","typ","Vyberte"]
[null,null,"počet",""]
[null,null,"sklon","",null,"U šikmých střech bývá shodný se sklonem střechy; u plochých střech většinou 45°; může být odlišný při použití nadzvedávací konstrukce."]
[null,"umístění kolektorů","azimut od jihu","Vyberte"]
[null,null,"poloha na střeše","Vyberte",null," Při pohledu z jihu."]
[null,"nový solární zásobník TV","typ",""]
[null,null,"objem [l]",""]
[null,"nové tepelné čerpadlo","typ","",null,"Žadatel doloží při náhradě za: kotel na tuhá paliva - platnou revizi, fotky kotle a likvidaci kotle; elektrokotel - vyúčtování spotřeby el. energie za uplynulé 2 roky; plynový kotel - fotku štítku, energetickou třídu domu."]
[null,null,"zajišťuje i ohřev TV","Vyberte"]
[null,{"$f":"IF($D$35=\"ohřev teplé vody\",\"\",\"akumulační nádrž\")","v":"akumulační nádrž"},{"$f":"IF($D$35=\"ohřev teplé vody\",\"\",\"typ\")","v":"typ"},""]
[null,null,"původní / nová","Vyberte"]
[null,null,"objem [l]",""]
[]
["F","Doplňující informace"]
[null,"Poznámky",null,""]
[]
[null,"Vyplněný dotazník odešlete na topeni@regulus.cz"]
[null,"Pro podání žádosti a zpracování potřebné dokumentace je třeba úplné a správné vyplnění celého formuláře (za správnost zodpovídá žadatel). Pokud si nejste jistí některou položkou formuláře, obraťte se na Vaši montážní firmu nebo projektanta, který patřičné informace zjistí a doplní. Zpracováním dokumentace pro dotaci na základě nepravdivě vyplněného dotazníku hrozí žadateli nepřiznání dotace nebo dokonce vrácení dotace a sankce ze strany SFŽP."]
[null,"Vyplněním dotazníku prohlašujete, že:"]
[null,"Čestně prohlašuji, že jsem se seznámil(a) s podmínkami dané výzvy programu Nová zelená úsporám zveřejněnými ke dni podání této žádosti na webových stránkách www.novazelenausporam.cz, a porozuměl(a) jsem jejich obsahu, a že údaje uvedené v této žádosti a v souvislosti s ní jsou pravdivé, úplné a nezkreslené, a že jsem žádné nezamlčel(a)."]
[null,"Čestně prohlašuji, že nemám závazky po lhůtě splatnosti u finančního úřadu, správy sociálního zabezpečení, Fondu, Ministerstva či jiného orgánu veřejné správy a mé právo nakládat s předmětnou nemovitostí není omezeno např. soudcovskou či exekutorskou zástavou, není nařízena exekuce či příkaz k prodeji předmětu podpory a předmět podpory není předmětem insolvenčního řízení či zajištění věci dle § 78 a násl. zákona č. 141/1961 Sb. trestní řád, ve znění pozdějších předpisů (zástavy z důvodu hypotéky a půjčky pro úpravu předmětu podpory nejsou na závadu)."]
[null,"Beru na vědomí, že veškerá korespondence a doručování dokumentů při administraci této žádosti bude prováděno elektronicky, včetně využití Agendového informačního systému SFŽP ČR."]
[null,"Čestně prohlašuji, že všichni vlastníci předmětné nemovitosti vyjádřili souhlas s realizací opatření dle této žádosti a s podáním této žádosti souhlasí."]

{"sheet":"kolektory","index":2,"n_rows":25,"n_cols":1,"rows_kept":25,"cut":false,"hidden":true,"merged":[]}
["Vyberte:"]
["KPG 1 ALC"]
["KPS1"]
["KPS11"]
["KPS11A"]
["KPG 1H ALC"]
["KPI 1 DC"]
["KTU 10 "]
["KTU 15 "]
["KTU 6R2"]
["KTU 9R2"]
["KPS1 Concept"]
["starší typy:"]
["KPG1+"]
["KPS1+ ANT"]
["KPS11+ ANT"]
["KPS 11+"]
["KPS 11 ALP"]
["KPH 1 ALP"]
["KPW 1 "]
["KPC 1+"]
["KPC 1 BP"]
["KPC 1 H+"]
["KPA 1 ALP"]
["Concept 300"]